similarity-n
type: LexicalEntry
canonical form: similarity
sense: 06261163-n
part of speech: noun

law of similarity-n
type: LexicalEntry
canonical form: law of similarity
sense: 06261163-n
part of speech: noun

06261163-n
type: LexicalConcept
in scheme: en-word.net
definition: a Gestalt principle of organization holding that (other things being equal) parts of a stimulus field that are similar to each other tend to be perceived as belonging together as a unit
ili: i69357
lexfile: noun.cognition
part of speech: noun
hypernym: 05887047-n