large indefinite quantity-n
type: LexicalEntry
canonical form: large indefinite quantity
sense: 13779864-n
part of speech: noun

large indefinite amount-n
type: LexicalEntry
canonical form: large indefinite amount
sense: 13779864-n
part of speech: noun

13779864-n
type: LexicalConcept
in scheme: en-word.net
definition: an indefinite quantity that is above the average in size or magnitude
ili: i109177
lexfile: noun.quantity
part of speech: noun
hypernym: 13597558-n