port-a
type: LexicalEntry
canonical form: port
sense: 02041149-s
part of speech: adjective

larboard-a
type: LexicalEntry
canonical form: larboard
sense: 02041149-s
part of speech: adjective

02041149-s
type: LexicalConcept
in scheme: en-word.net
definition: located on the left side of a ship or aircraft
ili: i11145
lexfile: adj.all
part of speech: adjective satellite
similar: https://en-word.net/synset/02040360-a

larboard-n
type: LexicalEntry
canonical form: larboard
sense: 03648242-n
part of speech: noun

port-n
type: LexicalEntry
canonical form: port
sense: 03648242-n
part of speech: noun

03648242-n
type: LexicalConcept
in scheme: en-word.net
definition: the left side of a ship or aircraft to someone who is aboard and facing the bow or nose
ili: i55541
lexfile: noun.artifact
part of speech: noun
hypernym: 04220693-n