laboratory glassware-n
type: LexicalEntry
canonical form: laboratory glassware
sense: 92406133-n
part of speech: noun

92406133-n
type: LexicalConcept
in scheme: en-word.net
definition: Laboratory glassware refers to a variety of equipment, traditionally made of glass, used for scientific experiments and other work in science, especially in chemistry and biology laboratories.
lexfile: noun.artifact
part of speech: noun
source: plWordNet 4.0
hypernym: 03443988-n