kit-n
type: LexicalEntry
canonical form: kit
sense: 01325646-n
part of speech: noun
sense: 03624605-n
sense: 03624859-n

01325646-n
type: LexicalConcept
in scheme: en-word.net
definition: young of any of various fur-bearing animals
example: a fox kit
ili: i42303
lexfile: noun.animal
part of speech: noun
hypernym: 01324345-n

kit out-v
type: LexicalEntry
canonical form: kit out
sense: 02346196-v
part of speech: verb

kit up-v
type: LexicalEntry
canonical form: kit up
sense: 02346196-v
part of speech: verb

kit-v
type: LexicalEntry
canonical form: kit
sense: 02346196-v
part of speech: verb

02346196-v
type: LexicalConcept
in scheme: en-word.net
definition: supply with a set of articles or tools
ili: i33444
lexfile: verb.possession
part of speech: verb
hypernym: 02344409-v

outfit-n
type: LexicalEntry
canonical form: outfit
sense: 03624605-n
part of speech: noun

03624605-n
type: LexicalConcept
in scheme: en-word.net
definition: gear consisting of a set of articles or tools for a specified purpose
ili: i55394
lexfile: noun.artifact
part of speech: noun
hypernym: 03435869-n

03624859-n
type: LexicalConcept
in scheme: en-word.net
definition: a case for containing a set of articles
ili: i55395
lexfile: noun.artifact
part of speech: noun
hypernym: 02978156-n