jiggermast-n
type: LexicalEntry
canonical form: jiggermast
sense: 03603839-n
part of speech: noun

jigger-n
type: LexicalEntry
canonical form: jigger
sense: 03603839-n
part of speech: noun

03603839-n
type: LexicalConcept
in scheme: en-word.net
definition: any small mast on a sailing vessel; especially the mizzenmast of a yawl
ili: i55265
lexfile: noun.artifact
part of speech: noun
hypernym: 03732251-n