investigation-n
type: LexicalEntry
canonical form: investigation
sense: 00635107-n
part of speech: noun

investigating-n
type: LexicalEntry
canonical form: investigating
sense: 00635107-n
part of speech: noun

00635107-n
type: LexicalConcept
in scheme: en-word.net
definition: the work of inquiring into something thoroughly and systematically
ili: i38759
lexfile: noun.act
part of speech: noun
hypernym: 00576778-n