interval-n
type: LexicalEntry
canonical form: interval
sense: 05097154-n
part of speech: noun
sense: 06025625-n
sense: 06871829-n
sense: 15294470-n

separation-n
type: LexicalEntry
canonical form: separation
sense: 05097154-n
part of speech: noun

05097154-n
type: LexicalConcept
in scheme: en-word.net
definition: the distance between things
example: fragile items require separation and cushioning
ili: i63744
lexfile: noun.attribute
part of speech: noun
hypernym: 05091408-n

06025625-n
type: LexicalConcept
in scheme: en-word.net
definition: a set containing all points (or all real numbers) between two given endpoints
ili: i68406
lexfile: noun.cognition
part of speech: noun
hypernym: 08016141-n

musical interval-n
type: LexicalEntry
canonical form: musical interval
sense: 06871829-n
part of speech: noun

06871829-n
type: LexicalConcept
in scheme: en-word.net
definition: the difference in pitch between two notes
ili: i72520
lexfile: noun.communication
part of speech: noun
hypernym: 06827728-n

time interval-n
type: LexicalEntry
canonical form: time interval
sense: 15294470-n
part of speech: noun

15294470-n
type: LexicalConcept
in scheme: en-word.net
definition: a definite length of time marked off by two instants
ili: i117490
lexfile: noun.time
part of speech: noun
hypernym: 00033914-n