intersperse-v
type: LexicalEntry
canonical form: intersperse
sense: 00189521-v
part of speech: verb
sense: 01379285-v

interlard-v
type: LexicalEntry
canonical form: interlard
sense: 00189521-v
part of speech: verb

00189521-v
type: LexicalConcept
in scheme: en-word.net
definition: introduce one's writing or speech with certain expressions
ili: i22660
lexfile: verb.change
part of speech: verb
hypernym: 00187671-v

01379285-v
type: LexicalConcept
in scheme: en-word.net
definition: place at intervals in or among
example: intersperse exclamation marks in the text
ili: i28591
lexfile: verb.contact
part of speech: verb
hypernym: 01496967-v