policy-n
type: LexicalEntry
canonical form: policy
sense: 06535632-n
part of speech: noun

insurance policy-n
type: LexicalEntry
canonical form: insurance policy
sense: 06535632-n
part of speech: noun

insurance-n
type: LexicalEntry
canonical form: insurance
sense: 06535632-n
part of speech: noun
sense: 13365819-n
sense: 14563428-n

06535632-n
type: LexicalConcept
in scheme: en-word.net
definition: written contract or certificate of insurance
example: you should have read the small print on your policy
ili: i70747
lexfile: noun.communication
part of speech: noun
hypernym: 06532935-n

13365819-n
type: LexicalConcept
in scheme: en-word.net
definition: promise of reimbursement in the case of loss; paid to people or companies so concerned about hazards that they have made prepayments to an insurance company
ili: i106834
lexfile: noun.possession
part of speech: noun
hypernym: 13365086-n

indemnity-n
type: LexicalEntry
canonical form: indemnity
sense: 14563428-n
part of speech: noun

14563428-n
type: LexicalConcept
in scheme: en-word.net
definition: protection against future loss
ili: i113411
lexfile: noun.state
part of speech: noun
hypernym: 14563562-n