data input device-n
type: LexicalEntry
canonical form: data input device
sense: 03168639-n
part of speech: noun

input device-n
type: LexicalEntry
canonical form: input device
sense: 03168639-n
part of speech: noun

03168639-n
type: LexicalConcept
in scheme: en-word.net
definition: a device that can be used to insert data into a computer or other computational device
ili: i52714
lexfile: noun.artifact
part of speech: noun
hypernym: 03922839-n