congenital-a
type: LexicalEntry
canonical form: congenital
sense: 01318798-s
part of speech: adjective

inborn-a
type: LexicalEntry
canonical form: inborn
sense: 01318798-s
part of speech: adjective

innate-a
type: LexicalEntry
canonical form: innate
sense: 01318798-s
part of speech: adjective
sense: 01338661-s
sense: https://en-word.net/lemma/innate-a#01641326-a

01318798-s
type: LexicalConcept
in scheme: en-word.net
definition: present at birth but not necessarily hereditary; acquired during fetal development
ili: i7168
lexfile: adj.all
part of speech: adjective satellite
similar: https://en-word.net/synset/01318461-a

natural-a
type: LexicalEntry
canonical form: natural
sense: 01338661-s
part of speech: adjective

born-a
type: LexicalEntry
canonical form: born
sense: 01338661-s
part of speech: adjective

01338661-s
type: LexicalConcept
in scheme: en-word.net
definition: being talented through inherited qualities
example: a natural leader
example: a born musician
example: an innate talent
ili: i7283
lexfile: adj.all
part of speech: adjective satellite
similar: https://en-word.net/synset/01337350-a

unconditioned-a
type: LexicalEntry
canonical form: unconditioned
sense: https://en-word.net/lemma/unconditioned-a#01641326-a
part of speech: adjective

unlearned-a
type: LexicalEntry
canonical form: unlearned
sense: https://en-word.net/lemma/unlearned-a#01641326-a
part of speech: adjective

https://en-word.net/synset/01641326-a
type: LexicalConcept
in scheme: en-word.net
definition: not established by conditioning or learning
example: an unconditioned reflex
ili: i8960
lexfile: adj.all
part of speech: adjective
similar: 01641513-s