individuality-n
type: LexicalEntry
canonical form: individuality
sense: 04770548-n
part of speech: noun

individualism-n
type: LexicalEntry
canonical form: individualism
sense: 04770548-n
part of speech: noun
sense: 05971803-n
sense: 05971968-n

individuation-n
type: LexicalEntry
canonical form: individuation
sense: 04770548-n
part of speech: noun

04770548-n
type: LexicalConcept
in scheme: en-word.net
definition: the quality of being individual
example: so absorbed by the movement that she lost all sense of individuality
ili: i62048
lexfile: noun.attribute
part of speech: noun
attribute: https://en-word.net/synset/00495505-a
hypernym: 04623416-n

laissez faire-n
type: LexicalEntry
canonical form: laissez faire
sense: 05971803-n
part of speech: noun

05971803-n
type: LexicalConcept
in scheme: en-word.net
definition: the doctrine that government should not interfere in commercial affairs
ili: i68163
lexfile: noun.cognition
part of speech: noun
hypernym: 05952149-n

05971968-n
type: LexicalConcept
in scheme: en-word.net
definition: a belief in the importance of the individual and the virtue of self-reliance and personal independence
ili: i68164
lexfile: noun.cognition
part of speech: noun
hypernym: 05950141-n