incompleteness-n
type: LexicalEntry
canonical form: incompleteness
sense: 14485777-n
part of speech: noun

rawness-n
type: LexicalEntry
canonical form: rawness
sense: 14485777-n
part of speech: noun

14485777-n
type: LexicalConcept
in scheme: en-word.net
definition: the state of being crude and incomplete and imperfect
example: the study was criticized for incompleteness of data but it stimulated further research
example: the rawness of his diary made it unpublishable
ili: i113010
lexfile: noun.state
part of speech: noun
hypernym: 14484149-n