immolate-v
type: LexicalEntry
canonical form: immolate
sense: 02330732-v
part of speech: verb

02330732-v
type: LexicalConcept
in scheme: en-word.net
definition: offer as a sacrifice by killing or by giving up to destruction
example: The Aztecs immolated human victims
example: immolate the valuables at the temple
ili: i33364
lexfile: verb.possession
part of speech: verb
hypernym: 02330554-v