cash-n
type: LexicalEntry
canonical form: cash
sense: 13407638-n
part of speech: noun

immediate payment-n
type: LexicalEntry
canonical form: immediate payment
sense: 13407638-n
part of speech: noun

13407638-n
type: LexicalConcept
in scheme: en-word.net
definition: prompt payment for goods or services in currency or by check
ili: i107067
lexfile: noun.possession
part of speech: noun
hypernym: 13299398-n