starve-v
type: LexicalEntry
canonical form: starve
sense: 01190677-v
part of speech: verb
sense: 01191018-v

hunger-v
type: LexicalEntry
canonical form: hunger
sense: 01190677-v
part of speech: verb
sense: 01191018-v
sense: 02126423-v

famish-v
type: LexicalEntry
canonical form: famish
sense: 01190677-v
part of speech: verb

01190677-v
type: LexicalConcept
in scheme: en-word.net
definition: be hungry; go without food
example: Let's eat — I'm starving!
ili: i27558
lexfile: verb.consumption
part of speech: verb
hypernym: 00064841-v

crave-v
type: LexicalEntry
canonical form: crave
sense: 01191018-v
part of speech: verb

thirst-v
type: LexicalEntry
canonical form: thirst
sense: 01191018-v
part of speech: verb

lust-v
type: LexicalEntry
canonical form: lust
sense: 01191018-v
part of speech: verb

01191018-v
type: LexicalConcept
in scheme: en-word.net
definition: have a craving, appetite, or great desire for
ili: i27560
lexfile: verb.consumption
part of speech: verb
hypernym: 01829179-v

02126423-v
type: LexicalConcept
in scheme: en-word.net
definition: feel the need to eat
ili: i32366
lexfile: verb.perception
part of speech: verb
hypernym: 02126629-v

hunger-n
type: LexicalEntry
canonical form: hunger
sense: 04952431-n
part of speech: noun
sense: 14063016-n

hungriness-n
type: LexicalEntry
canonical form: hungriness
sense: 04952431-n
part of speech: noun
sense: 14063016-n

thirst-n
type: LexicalEntry
canonical form: thirst
sense: 04952431-n
part of speech: noun

thirstiness-n
type: LexicalEntry
canonical form: thirstiness
sense: 04952431-n
part of speech: noun

04952431-n
type: LexicalConcept
in scheme: en-word.net
definition: strong desire for something (not food or drink)
example: a thirst for knowledge
example: hunger for affection
ili: i62966
lexfile: noun.attribute
part of speech: noun
hypernym: 04952234-n

14063016-n
type: LexicalConcept
in scheme: en-word.net
definition: a physiological need for food; the consequence of food deprivation
ili: i110708
lexfile: noun.state
part of speech: noun
hypernym: 14058780-n