hull-v
type: LexicalEntry
canonical form: hull
sense: 00180221-v
part of speech: verb

00180221-v
type: LexicalConcept
in scheme: en-word.net
definition: remove the hulls from
example: hull the berries
ili: i22607
lexfile: verb.change
part of speech: verb
hypernym: 00173351-v

hull-n
type: LexicalEntry
canonical form: hull
sense: 03553806-n
part of speech: noun
sense: 11712459-n
sense: 13160695-n

03553806-n
type: LexicalConcept
in scheme: en-word.net
definition: the frame or body of ship
ili: i54981
lexfile: noun.artifact
part of speech: noun
hypernym: 04348764-n
mero part: 03614755-n
mero part: 03615172-n
mero part: 04094238-n
mero part: 04096094-n

11712459-n
type: LexicalConcept
in scheme: en-word.net
definition: persistent enlarged calyx at base of e.g. a strawberry or raspberry
ili: i98791
lexfile: noun.plant
part of speech: noun
hypernym: 11711992-n

13160695-n
type: LexicalConcept
in scheme: en-word.net
definition: dry outer covering of a fruit or seed or nut
ili: i105697
lexfile: noun.plant
part of speech: noun
hypernym: 13160424-n