home appliance-n
type: LexicalEntry
canonical form: home appliance
sense: 03533443-n
part of speech: noun

household appliance-n
type: LexicalEntry
canonical form: household appliance
sense: 03533443-n
part of speech: noun

03533443-n
type: LexicalConcept
in scheme: en-word.net
definition: an appliance that does a particular job in the home
ili: i54860
lexfile: noun.artifact
part of speech: noun
hypernym: 02732781-n