vacation-v
type: LexicalEntry
canonical form: vacation
sense: 02714581-v
part of speech: verb

holiday-v
type: LexicalEntry
canonical form: holiday
sense: 02714581-v
part of speech: verb

02714581-v
type: LexicalConcept
in scheme: en-word.net
definition: spend or take a vacation
ili: i35204
lexfile: verb.stative
part of speech: verb
hypernym: 02714280-v

vacation-n
type: LexicalEntry
canonical form: vacation
sense: 15162842-n
part of speech: noun

holiday-n
type: LexicalEntry
canonical form: holiday
sense: 15162842-n
part of speech: noun
sense: 15208263-n

15162842-n
type: LexicalConcept
in scheme: en-word.net
definition: leisure time away from work devoted to rest or pleasure
example: we get two weeks of vacation every summer
example: we took a short holiday in Puerto Rico
ili: i116749
lexfile: noun.time
part of speech: noun
hypernym: 15162628-n

15208263-n
type: LexicalConcept
in scheme: en-word.net
definition: a day on which work is suspended by law or custom
example: no mail is delivered on federal holidays
example: it's a good thing that New Year's was a holiday because everyone had a hangover
ili: i117003
lexfile: noun.time
part of speech: noun
hypernym: 15182185-n