hinge-v
type: LexicalEntry
canonical form: hinge
sense: 01299760-v
part of speech: verb

01299760-v
type: LexicalConcept
in scheme: en-word.net
definition: attach with a hinge
ili: i28158
lexfile: verb.contact
part of speech: verb
hypernym: 01299048-v

hinge-n
type: LexicalEntry
canonical form: hinge
sense: 03526239-n
part of speech: noun
sense: 13966650-n

flexible joint-n
type: LexicalEntry
canonical form: flexible joint
sense: 03526239-n
part of speech: noun

03526239-n
type: LexicalConcept
in scheme: en-word.net
definition: a joint that holds two parts together so that one can swing relative to the other
ili: i54816
lexfile: noun.artifact
part of speech: noun
hypernym: 03606190-n
mero part: 03950300-n

13966650-n
type: LexicalConcept
in scheme: en-word.net
definition: a circumstance upon which subsequent events depend
example: his absence is the hinge of our plan
ili: i110216
lexfile: noun.state
part of speech: noun
hypernym: 13965927-n