heroic-a
type: LexicalEntry
canonical form: heroic
sense: 00252000-s
part of speech: adjective

heroical-a
type: LexicalEntry
canonical form: heroical
sense: 00252000-s
part of speech: adjective

00252000-s
type: LexicalConcept
in scheme: en-word.net
definition: having or displaying qualities appropriate for heroes
example: the heroic attack on the beaches of Normandy
example: heroic explorers
ili: i1397
lexfile: adj.all
part of speech: adjective satellite
similar: https://en-word.net/synset/00250587-a