henna-v
type: LexicalEntry
canonical form: henna
sense: 00284424-v
part of speech: verb

00284424-v
type: LexicalConcept
in scheme: en-word.net
definition: apply henna to one's hair
example: She hennas her hair every month
ili: i23136
lexfile: verb.change
part of speech: verb
hypernym: 00287688-v

henna-n
type: LexicalEntry
canonical form: henna
sense: 15013308-n
part of speech: noun

15013308-n
type: LexicalConcept
in scheme: en-word.net
definition: a reddish brown dye used especially on hair
ili: i115912
lexfile: noun.substance
part of speech: noun
hypernym: 15013061-n