hem-v
type: LexicalEntry
canonical form: hem
sense: 01063821-v
part of speech: verb
sense: 01332414-v

01063821-v
type: LexicalConcept
in scheme: en-word.net
definition: utter ‘hem’ or ‘ahem’
ili: i26893
lexfile: verb.communication
part of speech: verb
hypernym: 00985856-v

01332414-v
type: LexicalConcept
in scheme: en-word.net
definition: fold over and sew together to provide with a hem
example: hem my skirt
ili: i28332
lexfile: verb.contact
part of speech: verb
hypernym: 01331921-v

hem-n
type: LexicalEntry
canonical form: hem
sense: 03518771-n
part of speech: noun
sense: 07141229-n

03518771-n
type: LexicalConcept
in scheme: en-word.net
definition: the edge of a piece of cloth; especially the finished edge that has been doubled under and stitched down
example: the hem of her dress was stained
example: let down the hem
example: he stitched weights into the curtain's hem
example: it seeped along the hem of his jacket
ili: i54770
lexfile: noun.artifact
part of speech: noun
hypernym: 03269453-n

ahem-n
type: LexicalEntry
canonical form: ahem
sense: 07141229-n
part of speech: noun

07141229-n
type: LexicalConcept
in scheme: en-word.net
definition: the utterance of a sound similar to clearing the throat; intended to get attention, express hesitancy, fill a pause, hide embarrassment, warn a friend, etc.
ili: i74110
lexfile: noun.communication
part of speech: noun
hypernym: 07124555-n