headlight-n
type: LexicalEntry
canonical form: headlight
sense: 03509141-n
part of speech: noun

headlamp-n
type: LexicalEntry
canonical form: headlamp
sense: 03509141-n
part of speech: noun

03509141-n
type: LexicalConcept
in scheme: en-word.net
definition: a powerful light with reflector; attached to the front of an automobile or locomotive
ili: i54716
lexfile: noun.artifact
part of speech: noun
hypernym: 03670692-n
mero part: 03400695-n