anteroom-n
type: LexicalEntry
canonical form: anteroom
sense: 02718424-n
part of speech: noun

antechamber-n
type: LexicalEntry
canonical form: antechamber
sense: 02718424-n
part of speech: noun

entrance hall-n
type: LexicalEntry
canonical form: entrance hall
sense: 02718424-n
part of speech: noun

hall-n
type: LexicalEntry
canonical form: hall
sense: 02718424-n
part of speech: noun
sense: 03229596-n
sense: 03483839-n
sense: 03483990-n
sense: 03484204-n
sense: 03485035-n
sense: 03724120-n
sense: 03724592-n

foyer-n
type: LexicalEntry
canonical form: foyer
sense: 02718424-n
part of speech: noun

lobby-n
type: LexicalEntry
canonical form: lobby
sense: 02718424-n
part of speech: noun

vestibule-n
type: LexicalEntry
canonical form: vestibule
sense: 02718424-n
part of speech: noun

02718424-n
type: LexicalConcept
in scheme: en-word.net
definition: a large entrance or reception room or area
ili: i50042
lexfile: noun.artifact
part of speech: noun
hypernym: 04112987-n

dormitory-n
type: LexicalEntry
canonical form: dormitory
sense: 03229596-n
part of speech: noun

dorm-n
type: LexicalEntry
canonical form: dorm
sense: 03229596-n
part of speech: noun

residence hall-n
type: LexicalEntry
canonical form: residence hall
sense: 03229596-n
part of speech: noun

student residence-n
type: LexicalEntry
canonical form: student residence
sense: 03229596-n
part of speech: noun

student lodging-n
type: LexicalEntry
canonical form: student lodging
sense: 03229596-n
part of speech: noun

03229596-n
type: LexicalConcept
in scheme: en-word.net
definition: a college or university building containing living quarters for students
ili: i53068
lexfile: noun.artifact
part of speech: noun
hypernym: 03684710-n
hypernym: 02916498-n

03483839-n
type: LexicalConcept
in scheme: en-word.net
definition: a large building for meetings or entertainment
ili: i54568
lexfile: noun.artifact
part of speech: noun
hypernym: 02916498-n

03483990-n
type: LexicalConcept
in scheme: en-word.net
definition: a large room for gatherings, receiving guests, or entertainment
example: lecture hall
example: pool hall
ili: i54569
lexfile: noun.artifact
part of speech: noun
hypernym: 04112987-n

03484204-n
type: LexicalConcept
in scheme: en-word.net
definition: a large building used by a college or university for teaching or research
example: halls of learning
ili: i54570
lexfile: noun.artifact
part of speech: noun
hypernym: 02916498-n

hallway-n
type: LexicalEntry
canonical form: hallway
sense: 03485035-n
part of speech: noun

03485035-n
type: LexicalConcept
in scheme: en-word.net
definition: an interior passage or corridor onto which rooms open
example: the elevators were at the end of the hall
ili: i54575
lexfile: noun.artifact
part of speech: noun
hypernym: 03116750-n
mero part: 02993828-n
mero part: 03370438-n
mero part: 04554141-n

manor hall-n
type: LexicalEntry
canonical form: manor hall
sense: 03724120-n
part of speech: noun

03724120-n
type: LexicalConcept
in scheme: en-word.net
definition: the large room of a manor or castle
ili: i55995
lexfile: noun.artifact
part of speech: noun
hypernym: 04112987-n

mansion-n
type: LexicalEntry
canonical form: mansion
sense: 03724592-n
part of speech: noun

mansion house-n
type: LexicalEntry
canonical form: mansion house
sense: 03724592-n
part of speech: noun

manse-n
type: LexicalEntry
canonical form: manse
sense: 03724592-n
part of speech: noun

residence-n
type: LexicalEntry
canonical form: residence
sense: 03724592-n
part of speech: noun

03724592-n
type: LexicalConcept
in scheme: en-word.net
definition: a large and imposing house
ili: i55999
lexfile: noun.artifact
part of speech: noun
hypernym: 03549540-n
mero part: 03724120-n