finespun-a
type: LexicalEntry
canonical form: finespun
sense: 01844113-s
part of speech: adjective

hairsplitting-a
type: LexicalEntry
canonical form: hairsplitting
sense: 01844113-s
part of speech: adjective

01844113-s
type: LexicalConcept
in scheme: en-word.net
definition: developed in excessively fine detail
example: finespun distinctions
ili: i10100
lexfile: adj.all
part of speech: adjective satellite
similar: https://en-word.net/synset/01843460-a

hairsplitting-n
type: LexicalEntry
canonical form: hairsplitting
sense: 05757207-n
part of speech: noun

word-splitting-n
type: LexicalEntry
canonical form: word-splitting
sense: 05757207-n
part of speech: noun

05757207-n
type: LexicalConcept
in scheme: en-word.net
definition: making too fine distinctions of little importance
example: they didn't take his hairsplitting seriously
ili: i67115
lexfile: noun.cognition
part of speech: noun
hypernym: 05756230-n