groin-v
type: LexicalEntry
canonical form: groin
sense: 01659650-v
part of speech: verb

01659650-v
type: LexicalConcept
in scheme: en-word.net
definition: build with groins
example: The ceiling was groined
ili: i30015
lexfile: verb.creation
part of speech: verb
domain topic: 00912746-n
hypernym: 01658171-v

breakwater-n
type: LexicalEntry
canonical form: breakwater
sense: 02897867-n
part of speech: noun

groin-n
type: LexicalEntry
canonical form: groin
sense: 02897867-n
part of speech: noun
sense: 03466715-n
sense: 05605489-n

groyne-n
type: LexicalEntry
canonical form: groyne
sense: 02897867-n
part of speech: noun

mole-n-1
type: LexicalEntry
canonical form: mole
sense: 02897867-n
part of speech: noun

bulwark-n
type: LexicalEntry
canonical form: bulwark
sense: 02897867-n
part of speech: noun

seawall-n
type: LexicalEntry
canonical form: seawall
sense: 02897867-n
part of speech: noun

jetty-n
type: LexicalEntry
canonical form: jetty
sense: 02897867-n
part of speech: noun

02897867-n
type: LexicalConcept
in scheme: en-word.net
definition: a protective structure of stone or concrete; extends from shore into the water to prevent a beach from washing away
ili: i51103
lexfile: noun.artifact
part of speech: noun
hypernym: 02799782-n

03466715-n
type: LexicalConcept
in scheme: en-word.net
definition: a curved edge formed by two intersecting vaults
ili: i54456
lexfile: noun.artifact
part of speech: noun
hypernym: 03269047-n

inguen-n
type: LexicalEntry
canonical form: inguen
sense: 05605489-n
part of speech: noun

05605489-n
type: LexicalConcept
in scheme: en-word.net
definition: the crease at the junction of the inner part of the thigh with the trunk together with the adjacent region and often including the external genitals
ili: i66327
lexfile: noun.body
part of speech: noun
hypernym: 05229188-n