greeting card-n
type: LexicalEntry
canonical form: greeting card
sense: 06639957-n
part of speech: noun

06639957-n
type: LexicalConcept
in scheme: en-word.net
definition: a card sent to express personal greetings
ili: i71309
lexfile: noun.communication
part of speech: noun
hypernym: 06639513-n