Procyon-n
type: LexicalEntry
canonical form: Procyon
sense: 02510494-n
part of speech: noun

genus Procyon-n
type: LexicalEntry
canonical form: genus Procyon
sense: 02510494-n
part of speech: noun

02510494-n
type: LexicalConcept
in scheme: en-word.net
definition: the type genus of the family Procyonidae: raccoons
ili: i48856
lexfile: noun.animal
part of speech: noun
hypernym: 01867348-n
mero member: 02510652-n