collector-n
type: LexicalEntry
canonical form: collector
sense: 09955820-n
part of speech: noun

gatherer-n
type: LexicalEntry
canonical form: gatherer
sense: 09955820-n
part of speech: noun
sense: 10141957-n

accumulator-n
type: LexicalEntry
canonical form: accumulator
sense: 09955820-n
part of speech: noun

09955820-n
type: LexicalConcept
in scheme: en-word.net
definition: a person who is employed to collect payments (as for rent or taxes)
ili: i89073
lexfile: noun.person
part of speech: noun
domain topic: 13330021-n
hypernym: 09655706-n

10141957-n
type: LexicalConcept
in scheme: en-word.net
definition: a person who gathers
example: they were a society of hunters and gatherers
ili: i90164
lexfile: noun.person
part of speech: noun
hypernym: 09786620-n