charcoal-n
type: LexicalEntry
canonical form: charcoal
sense: 03011428-n
part of speech: noun

fusain-n
type: LexicalEntry
canonical form: fusain
sense: 03011428-n
part of speech: noun

03011428-n
type: LexicalConcept
in scheme: en-word.net
definition: a stick of black carbon material used for drawing
ili: i51783
lexfile: noun.artifact
part of speech: noun
hypernym: 04615925-n