funnel-n
type: LexicalEntry
canonical form: funnel
sense: 13895461-n
part of speech: noun

funnel shape-n
type: LexicalEntry
canonical form: funnel shape
sense: 13895461-n
part of speech: noun

13895461-n
type: LexicalConcept
in scheme: en-word.net
definition: a conical shape with a wider and a narrower opening at the two ends
ili: i109830
lexfile: noun.shape
part of speech: noun
hypernym: 13895231-n