fug-n
type: LexicalEntry
canonical form: fug
sense: 14545556-n
part of speech: noun

14545556-n
type: LexicalConcept
in scheme: en-word.net
definition: (British informal) an airless smoky smelly atmosphere
ili: i113315
lexfile: noun.state
part of speech: noun
domain region: 08879115-n
exemplifies: 07089193-n
hypernym: 14545250-n