facade-n
type: LexicalEntry
canonical form: facade
sense: 03318278-n
part of speech: noun

frontage-n
type: LexicalEntry
canonical form: frontage
sense: 03318278-n
part of speech: noun
sense: 05131200-n
sense: 13850156-n

frontal-n
type: LexicalEntry
canonical form: frontal
sense: 03318278-n
part of speech: noun

03318278-n
type: LexicalConcept
in scheme: en-word.net
definition: the face or front of a building
ili: i53548
lexfile: noun.artifact
part of speech: noun
hypernym: 03403382-n

05131200-n
type: LexicalConcept
in scheme: en-word.net
definition: the extent of land abutting on a street or water
ili: i63915
lexfile: noun.attribute
part of speech: noun
domain topic: 09434308-n
hypernym: 05130681-n

13850156-n
type: LexicalConcept
in scheme: en-word.net
definition: the direction in which something (such as a building) faces
ili: i109571
lexfile: noun.relation
part of speech: noun
hypernym: 13849639-n