freedom-n
type: LexicalEntry
canonical form: freedom
sense: 14015308-n
part of speech: noun
sense: 14552475-n

14015308-n
type: LexicalConcept
in scheme: en-word.net
definition: the condition of being free; the power to act or speak or think without externally imposed restraints
ili: i110463
lexfile: noun.state
part of speech: noun
attribute: https://en-word.net/synset/01065188-a
attribute: https://en-word.net/synset/01067975-a
hypernym: 00024900-n

exemption-n
type: LexicalEntry
canonical form: exemption
sense: 14552475-n
part of speech: noun

14552475-n
type: LexicalConcept
in scheme: en-word.net
definition: immunity from an obligation or duty
ili: i113352
lexfile: noun.state
part of speech: noun
hypernym: 14550366-n