fountain pen-n
type: LexicalEntry
canonical form: fountain pen
sense: 03393029-n
part of speech: noun

03393029-n
type: LexicalConcept
in scheme: en-word.net
definition: a pen that is supplied with ink from a reservoir in its barrel
ili: i54010
lexfile: noun.artifact
part of speech: noun
hypernym: 03913116-n
mero part: 03576857-n