forum-n
type: LexicalEntry
canonical form: forum
sense: 03391266-n
part of speech: noun
sense: 08326684-n

assembly-n
type: LexicalEntry
canonical form: assembly
sense: 03391266-n
part of speech: noun

meeting place-n
type: LexicalEntry
canonical form: meeting place
sense: 03391266-n
part of speech: noun

03391266-n
type: LexicalConcept
in scheme: en-word.net
definition: a public facility to meet for open discussion
ili: i53999
lexfile: noun.artifact
part of speech: noun
hypernym: 03319968-n

08326684-n
type: LexicalConcept
in scheme: en-word.net
definition: a public meeting or assembly for open discussion
ili: i80803
lexfile: noun.group
part of speech: noun
hypernym: 08324519-n