foreign aid-n
type: LexicalEntry
canonical form: foreign aid
sense: 13287538-n
part of speech: noun

13287538-n
type: LexicalConcept
in scheme: en-word.net
definition: aid (such as economic or military assistance) provided to one nation by another
ili: i106370
lexfile: noun.possession
part of speech: noun
domain topic: 08215965-n
hypernym: 13286803-n