flower head-n
type: LexicalEntry
canonical form: flower head
sense: 11694556-n
part of speech: noun

11694556-n
type: LexicalConcept
in scheme: en-word.net
definition: a shortened compact cluster of flowers so arranged that the whole gives the effect of a single flower as in clover or members of the family Compositae
ili: i98679
lexfile: noun.plant
part of speech: noun
hypernym: 11694783-n
mero part: 11695054-n