finder-n
type: LexicalEntry
canonical form: finder
sense: 03345668-n
part of speech: noun
sense: 10110267-n
sense: 10110514-n

viewfinder-n
type: LexicalEntry
canonical form: viewfinder
sense: 03345668-n
part of speech: noun

view finder-n
type: LexicalEntry
canonical form: view finder
sense: 03345668-n
part of speech: noun

03345668-n
type: LexicalConcept
in scheme: en-word.net
definition: optical device that helps a user to find the target of interest
ili: i53709
lexfile: noun.artifact
part of speech: noun
hypernym: 03856861-n

discoverer-n
type: LexicalEntry
canonical form: discoverer
sense: 10110267-n
part of speech: noun

spotter-n
type: LexicalEntry
canonical form: spotter
sense: 10110267-n
part of speech: noun

10110267-n
type: LexicalConcept
in scheme: en-word.net
definition: someone who is the first to observe something
ili: i89952
lexfile: noun.person
part of speech: noun
hypernym: 09649777-n

10110514-n
type: LexicalConcept
in scheme: en-word.net
definition: someone who comes upon something after searching
ili: i89953
lexfile: noun.person
part of speech: noun
hypernym: 10595231-n