female-n
type: LexicalEntry
canonical form: female
sense: 01323363-n
part of speech: noun
sense: 09642198-n

01323363-n
type: LexicalConcept
in scheme: en-word.net
definition: an animal that produces gametes (ova) that can be fertilized by male gametes (spermatozoa)
ili: i42288
lexfile: noun.animal
part of speech: noun
hypernym: 00015568-n

female-a
type: LexicalEntry
canonical form: female
sense: https://en-word.net/lemma/female-a#01481113-a
part of speech: adjective
sense: 01481489-s
sense: 01487758-s

https://en-word.net/synset/01481113-a
type: LexicalConcept
in scheme: en-word.net
definition: being the sex (of plant or animal) that produces fertilizable gametes (ova) from which offspring develop
example: a female heir
example: female holly trees bear the berries
ili: i8094
lexfile: adj.all
part of speech: adjective
also: https://en-word.net/synset/01487390-a
attribute: 05014082-n
domain topic: 06047178-n
similar: 01481489-s
similar: 01481660-s
similar: 01481789-s

01481489-s
type: LexicalConcept
in scheme: en-word.net
definition: for or pertaining to or composed of women or girls
example: the female lead in the play
example: a female chorus
ili: i8095
lexfile: adj.all
part of speech: adjective satellite
similar: https://en-word.net/synset/01481113-a

distaff-a
type: LexicalEntry
canonical form: distaff
sense: 01487758-s
part of speech: adjective

01487758-s
type: LexicalConcept
in scheme: en-word.net
definition: characteristic of or peculiar to a woman
example: female sensitiveness
example: female suffrage
ili: i8138
lexfile: adj.all
part of speech: adjective satellite
similar: https://en-word.net/synset/01487390-a

female person-n
type: LexicalEntry
canonical form: female person
sense: 09642198-n
part of speech: noun

09642198-n
type: LexicalConcept
in scheme: en-word.net
definition: a person who belongs to the sex that can have babies
ili: i87211
lexfile: noun.person
part of speech: noun
hypernym: 00007846-n
mero part: 05227197-n