discrimination-n
type: LexicalEntry
canonical form: discrimination
sense: 01156043-n
part of speech: noun

favoritism-n
type: LexicalEntry
canonical form: favoritism
sense: 01156043-n
part of speech: noun
sense: 06209181-n

favouritism-n
type: LexicalEntry
canonical form: favouritism
sense: 01156043-n
part of speech: noun
sense: 06209181-n

01156043-n
type: LexicalConcept
in scheme: en-word.net
definition: unfair treatment of a person or group on the basis of prejudice
ili: i41447
lexfile: noun.act
part of speech: noun
hypernym: 01125919-n

06209181-n
type: LexicalConcept
in scheme: en-word.net
definition: an inclination to favor some person or group
ili: i69107
lexfile: noun.cognition
part of speech: noun
hypernym: 06206319-n