exporting-n
type: LexicalEntry
canonical form: exporting
sense: 01113857-n
part of speech: noun

exportation-n
type: LexicalEntry
canonical form: exportation
sense: 01113857-n
part of speech: noun

01113857-n
type: LexicalConcept
in scheme: en-word.net
definition: the commercial activity of selling and shipping goods to a foreign country
ili: i41227
lexfile: noun.act
part of speech: noun
hypernym: 01092370-n