exporting-n
type: LexicalEntry
canonical form: exporting
sense: 01113857-n
part of speech: noun

exportation-n
type: LexicalEntry
canonical form: exportation
sense: 01113857-n
part of speech: noun
sense: 03311152-n

01113857-n
type: LexicalConcept
in scheme: en-word.net
definition: the commercial activity of selling and shipping goods to a foreign country
ili: i41227
lexfile: noun.act
part of speech: noun
hypernym: 01092370-n

export-n
type: LexicalEntry
canonical form: export
sense: 03311152-n
part of speech: noun

03311152-n
type: LexicalConcept
in scheme: en-word.net
definition: commodities (goods or services) sold to a foreign country
ili: i53527
lexfile: noun.artifact
part of speech: noun
hypernym: 03080712-n