power shovel-n
type: LexicalEntry
canonical form: power shovel
sense: 04002774-n
part of speech: noun

excavator-n
type: LexicalEntry
canonical form: excavator
sense: 04002774-n
part of speech: noun
sense: 09640322-n

digger-n
type: LexicalEntry
canonical form: digger
sense: 04002774-n
part of speech: noun

shovel-n
type: LexicalEntry
canonical form: shovel
sense: 04002774-n
part of speech: noun

04002774-n
type: LexicalConcept
in scheme: en-word.net
definition: a machine for excavating
ili: i57631
lexfile: noun.artifact
part of speech: noun
hypernym: 03705309-n

09640322-n
type: LexicalConcept
in scheme: en-word.net
definition: a workman who excavates for foundations of buildings or for quarrying
ili: i87202
lexfile: noun.person
part of speech: noun
hypernym: 10810861-n