escargot-n
type: LexicalEntry
canonical form: escargot
sense: 07798451-n
part of speech: noun

snail-n
type: LexicalEntry
canonical form: snail
sense: 07798451-n
part of speech: noun

07798451-n
type: LexicalConcept
in scheme: en-word.net
definition: edible terrestrial snail usually served in the shell with a sauce of melted butter and garlic
ili: i77981
lexfile: noun.food
part of speech: noun
hypernym: 07665463-n