equipment-n
type: LexicalEntry
canonical form: equipment
sense: 03298959-n
part of speech: noun

03298959-n
type: LexicalConcept
in scheme: en-word.net
definition: an instrumentality needed for an undertaking or to perform a service
ili: i53457
lexfile: noun.artifact
part of speech: noun
hypernym: 03580409-n