epic-a
type: LexicalEntry
canonical form: epic
sense: https://en-word.net/lemma/epic-a#03027102-a
part of speech: adjective

epical-a
type: LexicalEntry
canonical form: epical
sense: https://en-word.net/lemma/epical-a#03027102-a
part of speech: adjective

https://en-word.net/synset/03027102-a
type: LexicalConcept
in scheme: en-word.net
definition: constituting or having to do with or suggestive of a literary epic
example: epic tradition
ili: i17251
lexfile: adj.pert
part of speech: adjective