envy-n
type: LexicalEntry
canonical form: envy
sense: 07565182-n
part of speech: noun

enviousness-n
type: LexicalEntry
canonical form: enviousness
sense: 07565182-n
part of speech: noun

07565182-n
type: LexicalConcept
in scheme: en-word.net
definition: a feeling of grudging admiration and desire to have something that is possessed by another
ili: i76435
lexfile: noun.feeling
part of speech: noun
hypernym: 07564444-n